{"text_format":"3","workbook":"xlsx","n_sheets":7,"sheets":["Segment 1","Segment 2","Segment 3","Segment 4","Exemple","Informations","Liste des modules"],"not_rendered":{"images":2,"defined_names":13,"comments":6},"read":"whole","date_system":"1900"}

{"sheet":"Segment 1","index":0,"n_rows":34,"n_cols":11,"rows_kept":34,"merged":[[2,1,2,6],[3,1,3,6],[4,1,4,6],[5,1,5,6],[6,1,6,5],[7,3,7,6],[7,9,7,10],[33,0,33,3]]}
["Aide à la planification des segments xBus",{"$nulls":9},{"$f":"Version","v":"V2.00"}]
[]
["Projet:"]
["Segment:"]
["Client:"]
["Responsable:"]
["Notes:",{"$nulls":5},{"$f":"IF(ISBLANK($B$10),\"\",VLOOKUP($B$10,Liste_Gateways_Komplett,2,FALSE))","v":{"v":290,"d":"290.0"}},{"$f":"IF(ISBLANK($B$10),\"\",VLOOKUP($B$10,Liste_Gateways_Komplett,3,FALSE))","v":0.5},{"$f":"IF(ISBLANK($B$10),\"\",VLOOKUP($B$10,Liste_Gateways_Komplett,4,FALSE))","v":85}]
[{"$nulls":3},"Maximum",{"$nulls":5},"Moyenne"]
["Quantité","Modules","Notes","I [mA]","Courrant [mA]","Power [W]","Charge du bus [%]",null,null,"Courrant [mA]","Power [W]"]
[1,"xBG-B1-V","Passerelle xBus",null,null,{"$f":"H7+SUM(F11:F33)*I7/100","v":{"v":0.5,"d":"0.50"}},{"$nulls":4},{"$f":"H7+SUM(K11:K33)*I7/100","v":{"v":0.5,"d":"0.50"}}]
[{"$nulls":3},{"$f":"IF(ISBLANK(B11),\"\",VLOOKUP(B11,Liste_Gesamt,2,FALSE))","v":""},{"$f":"IF(ISBLANK(B11),\"\",A11*D11)","v":""},{"$f":"IF(ISBLANK(B11),\"\",E11*xBus_U/1000+VLOOKUP(B11,Liste_Gesamt,5,FALSE))","v":""},{"$f":"IF(ISBLANK(B11),\"\",100*E11/$G$7)","v":""},null,null,{"$f":"IF(ISBLANK(B11),\"\",VLOOKUP(B11,Liste_Gesamt,4,FALSE) * A11)","v":""},{"$f":"IF(ISBLANK(B11),\"\",J11*xBus_U/1000+VLOOKUP(B11,Liste_Gesamt,5,FALSE))","v":""}]
[{"$nulls":3},"","","","",null,null,"",""]
[{"$nulls":3},"","","","",null,null,"",""]
[{"$nulls":3},"","","","",null,null,"",""]
[{"$nulls":3},"","","","",null,null,"",""]
[{"$nulls":3},"","","","",null,null,"",""]
[{"$nulls":3},"","","","",null,null,"",""]
[{"$nulls":3},"","","","",null,null,"",""]
[{"$nulls":3},"","","","",null,null,"",""]
[{"$nulls":3},"","","","",null,null,"",""]
[{"$nulls":3},"","","","",null,null,"",""]
[{"$nulls":3},"","","","",null,null,"",""]
[{"$nulls":3},"","","","",null,null,"",""]
[{"$nulls":3},"","","","",null,null,"",""]
[{"$nulls":3},"","","","",null,null,"",""]
[{"$nulls":3},"","","","",null,null,"",""]
[{"$nulls":3},"","","","",null,null,"",""]
[{"$nulls":3},"","","","",null,null,"",""]
[{"$nulls":3},"","","","",null,null,"",""]
[{"$nulls":3},"","","","",null,null,"",""]
[{"$nulls":3},"","","","",null,null,"",""]
[{"$nulls":3},"","","","",null,null,"",""]
[{"$nulls":3},"","","","",null,null,"",""]
[{"$f":"IF(G34>100,\"Segment xBus surchargé! Déplacer des modules à un autre segment. Voir registre 'Informations'.\",\"Plus d'informations sont à disposition au registre 'Informations'.\")","v":"Plus d'informations sont à disposition au registre 'Informations'."},{"$nulls":3},{"$f":"SUM(E11:E33)","v":{"v":0,"d":"0 mA"}},{"$f":"SUM(F10:F33)","v":{"v":0.5,"d":"0.5 W"}},{"$f":"SUM(G11:G33)","v":{"v":0,"d":"0 %"}},null,null,{"$f":"SUM(J11:J33)","v":{"v":0,"d":"0 mA"}},{"$f":"SUM(K10:K33)","v":{"v":0.5,"d":"0.5 W"}}]

{"sheet":"Segment 2","index":1,"n_rows":34,"n_cols":11,"rows_kept":34,"merged":[[2,1,2,6],[3,1,3,6],[4,1,4,6],[5,1,5,6],[6,1,6,5],[7,3,7,6],[7,9,7,10],[33,0,33,3]]}
["Aide à la planification des segments xBus",{"$nulls":9},{"$f":"Version","v":"V2.00"}]
[]
["Projet:"]
["Segment:"]
["Client:"]
["Responsable:"]
["Notes:",{"$nulls":5},{"$f":"IF(ISBLANK($B$10),\"\",VLOOKUP($B$10,Liste_Gateways_Komplett,2,FALSE))","v":{"v":290,"d":"290.0"}},{"$f":"IF(ISBLANK($B$10),\"\",VLOOKUP($B$10,Liste_Gateways_Komplett,3,FALSE))","v":0.5},{"$f":"IF(ISBLANK($B$10),\"\",VLOOKUP($B$10,Liste_Gateways_Komplett,4,FALSE))","v":85}]
[{"$nulls":3},"Maximum",{"$nulls":5},"Moyenne"]
["Quantité","Modules","Notes","I [mA]","Courrant [mA]","Power [W]","Charge du bus [%]",null,null,"Courrant [mA]","Power [W]"]
[1,"xBG-B1-V","Passerelle xBus",null,null,{"$f":"H7+SUM(F11:F33)*I7/100","v":{"v":0.5,"d":"0.50"}},{"$nulls":4},{"$f":"H7+SUM(K11:K33)*I7/100","v":{"v":0.5,"d":"0.50"}}]
[{"$nulls":3},{"$f":"IF(ISBLANK(B11),\"\",VLOOKUP(B11,Liste_Gesamt,2,FALSE))","v":""},{"$f":"IF(ISBLANK(B11),\"\",A11*D11)","v":""},{"$f":"IF(ISBLANK(B11),\"\",E11*xBus_U/1000+VLOOKUP(B11,Liste_Gesamt,5,FALSE))","v":""},{"$f":"IF(ISBLANK(B11),\"\",100*E11/$G$7)","v":""},null,null,{"$f":"IF(ISBLANK(B11),\"\",VLOOKUP(B11,Liste_Gesamt,4,FALSE) * A11)","v":""},{"$f":"IF(ISBLANK(B11),\"\",J11*xBus_U/1000+VLOOKUP(B11,Liste_Gesamt,5,FALSE))","v":""}]
[{"$nulls":3},"","","","",null,null,"",""]
[{"$nulls":3},"","","","",null,null,"",""]
[{"$nulls":3},"","","","",null,null,"",""]
[{"$nulls":3},"","","","",null,null,"",""]
[{"$nulls":3},"","","","",null,null,"",""]
[{"$nulls":3},"","","","",null,null,"",""]
[{"$nulls":3},"","","","",null,null,"",""]
[{"$nulls":3},"","","","",null,null,"",""]
[{"$nulls":3},"","","","",null,null,"",""]
[{"$nulls":3},"","","","",null,null,"",""]
[{"$nulls":3},"","","","",null,null,"",""]
[{"$nulls":3},"","","","",null,null,"",""]
[{"$nulls":3},"","","","",null,null,"",""]
[{"$nulls":3},"","","","",null,null,"",""]
[{"$nulls":3},"","","","",null,null,"",""]
[{"$nulls":3},"","","","",null,null,"",""]
[{"$nulls":3},"","","","",null,null,"",""]
[{"$nulls":3},"","","","",null,null,"",""]
[{"$nulls":3},"","","","",null,null,"",""]
[{"$nulls":3},"","","","",null,null,"",""]
[{"$nulls":3},"","","","",null,null,"",""]
[{"$nulls":3},"","","","",null,null,"",""]
[{"$f":"IF(G34>100,\"Segment xBus surchargé! Déplacer des modules à un autre segment. Voir registre 'Informations'.\",\"Plus d'informations sont à disposition au registre 'Informations'.\")","v":"Plus d'informations sont à disposition au registre 'Informations'."},{"$nulls":3},{"$f":"SUM(E11:E33)","v":{"v":0,"d":"0 mA"}},{"$f":"SUM(F10:F33)","v":{"v":0.5,"d":"0.5 W"}},{"$f":"SUM(G11:G33)","v":{"v":0,"d":"0 %"}},null,null,{"$f":"SUM(J11:J33)","v":{"v":0,"d":"0 mA"}},{"$f":"SUM(K10:K33)","v":{"v":0.5,"d":"0.5 W"}}]

{"sheet":"Segment 3","index":2,"n_rows":34,"n_cols":11,"rows_kept":34,"merged":[[2,1,2,6],[3,1,3,6],[4,1,4,6],[5,1,5,6],[6,1,6,5],[7,3,7,6],[7,9,7,10],[33,0,33,3]]}
["Aide à la planification des segments xBus",{"$nulls":9},{"$f":"Version","v":"V2.00"}]
[]
["Projet:"]
["Segment:"]
["Client:"]
["Responsable:"]
["Notes:",{"$nulls":5},{"$f":"IF(ISBLANK($B$10),\"\",VLOOKUP($B$10,Liste_Gateways_Komplett,2,FALSE))","v":{"v":290,"d":"290.0"}},{"$f":"IF(ISBLANK($B$10),\"\",VLOOKUP($B$10,Liste_Gateways_Komplett,3,FALSE))","v":0.5},{"$f":"IF(ISBLANK($B$10),\"\",VLOOKUP($B$10,Liste_Gateways_Komplett,4,FALSE))","v":85}]
[{"$nulls":3},"Maximum",{"$nulls":5},"Moyenne"]
["Quantité","Modules","Notes","I [mA]","Courrant [mA]","Power [W]","Charge du bus [%]",null,null,"Courrant [mA]","Power [W]"]
[1,"xBG-B1-V","Passerelle xBus",null,null,{"$f":"H7+SUM(F11:F33)*I7/100","v":{"v":0.5,"d":"0.50"}},{"$nulls":4},{"$f":"H7+SUM(K11:K33)*I7/100","v":{"v":0.5,"d":"0.50"}}]
[{"$nulls":3},{"$f":"IF(ISBLANK(B11),\"\",VLOOKUP(B11,Liste_Gesamt,2,FALSE))","v":""},{"$f":"IF(ISBLANK(B11),\"\",A11*D11)","v":""},{"$f":"IF(ISBLANK(B11),\"\",E11*xBus_U/1000+VLOOKUP(B11,Liste_Gesamt,5,FALSE))","v":""},{"$f":"IF(ISBLANK(B11),\"\",100*E11/$G$7)","v":""},null,null,{"$f":"IF(ISBLANK(B11),\"\",VLOOKUP(B11,Liste_Gesamt,4,FALSE) * A11)","v":""},{"$f":"IF(ISBLANK(B11),\"\",J11*xBus_U/1000+VLOOKUP(B11,Liste_Gesamt,5,FALSE))","v":""}]
[{"$nulls":3},"","","","",null,null,"",""]
[{"$nulls":3},"","","","",null,null,"",""]
[{"$nulls":3},"","","","",null,null,"",""]
[{"$nulls":3},"","","","",null,null,"",""]
[{"$nulls":3},"","","","",null,null,"",""]
[{"$nulls":3},"","","","",null,null,"",""]
[{"$nulls":3},"","","","",null,null,"",""]
[{"$nulls":3},"","","","",null,null,"",""]
[{"$nulls":3},"","","","",null,null,"",""]
[{"$nulls":3},"","","","",null,null,"",""]
[{"$nulls":3},"","","","",null,null,"",""]
[{"$nulls":3},"","","","",null,null,"",""]
[{"$nulls":3},"","","","",null,null,"",""]
[{"$nulls":3},"","","","",null,null,"",""]
[{"$nulls":3},"","","","",null,null,"",""]
[{"$nulls":3},"","","","",null,null,"",""]
[{"$nulls":3},"","","","",null,null,"",""]
[{"$nulls":3},"","","","",null,null,"",""]
[{"$nulls":3},"","","","",null,null,"",""]
[{"$nulls":3},"","","","",null,null,"",""]
[{"$nulls":3},"","","","",null,null,"",""]
[{"$nulls":3},"","","","",null,null,"",""]
[{"$f":"IF(G34>100,\"Segment xBus surchargé! Déplacer des modules à un autre segment. Voir registre 'Informations'.\",\"Plus d'informations sont à disposition au registre 'Informations'.\")","v":"Plus d'informations sont à disposition au registre 'Informations'."},{"$nulls":3},{"$f":"SUM(E11:E33)","v":{"v":0,"d":"0 mA"}},{"$f":"SUM(F10:F33)","v":{"v":0.5,"d":"0.5 W"}},{"$f":"SUM(G11:G33)","v":{"v":0,"d":"0 %"}},null,null,{"$f":"SUM(J11:J33)","v":{"v":0,"d":"0 mA"}},{"$f":"SUM(K10:K33)","v":{"v":0.5,"d":"0.5 W"}}]

{"sheet":"Segment 4","index":3,"n_rows":34,"n_cols":11,"rows_kept":34,"merged":[[2,1,2,6],[3,1,3,6],[4,1,4,6],[5,1,5,6],[6,1,6,5],[7,3,7,6],[7,9,7,10],[33,0,33,3]]}
["Aide à la planification des segments xBus",{"$nulls":9},{"$f":"Version","v":"V2.00"}]
[]
["Projet:"]
["Segment:"]
["Client:"]
["Responsable:"]
["Notes:",{"$nulls":5},{"$f":"IF(ISBLANK($B$10),\"\",VLOOKUP($B$10,Liste_Gateways_Komplett,2,FALSE))","v":{"v":290,"d":"290.0"}},{"$f":"IF(ISBLANK($B$10),\"\",VLOOKUP($B$10,Liste_Gateways_Komplett,3,FALSE))","v":0.5},{"$f":"IF(ISBLANK($B$10),\"\",VLOOKUP($B$10,Liste_Gateways_Komplett,4,FALSE))","v":85}]
[{"$nulls":3},"Maximum",{"$nulls":5},"Moyenne"]
["Quantité","Modules","Notes","I [mA]","Courrant [mA]","Power [W]","Charge du bus [%]",null,null,"Courrant [mA]","Power [W]"]
[1,"xBG-B1-V","Passerelle xBus",null,null,{"$f":"H7+SUM(F11:F33)*I7/100","v":{"v":0.5,"d":"0.50"}},{"$nulls":4},{"$f":"H7+SUM(K11:K33)*I7/100","v":{"v":0.5,"d":"0.50"}}]
[{"$nulls":3},{"$f":"IF(ISBLANK(B11),\"\",VLOOKUP(B11,Liste_Gesamt,2,FALSE))","v":""},{"$f":"IF(ISBLANK(B11),\"\",A11*D11)","v":""},{"$f":"IF(ISBLANK(B11),\"\",E11*xBus_U/1000+VLOOKUP(B11,Liste_Gesamt,5,FALSE))","v":""},{"$f":"IF(ISBLANK(B11),\"\",100*E11/$G$7)","v":""},null,null,{"$f":"IF(ISBLANK(B11),\"\",VLOOKUP(B11,Liste_Gesamt,4,FALSE) * A11)","v":""},{"$f":"IF(ISBLANK(B11),\"\",J11*xBus_U/1000+VLOOKUP(B11,Liste_Gesamt,5,FALSE))","v":""}]
[{"$nulls":3},"","","","",null,null,"",""]
[{"$nulls":3},"","","","",null,null,"",""]
[{"$nulls":3},"","","","",null,null,"",""]
[{"$nulls":3},"","","","",null,null,"",""]
[{"$nulls":3},"","","","",null,null,"",""]
[{"$nulls":3},"","","","",null,null,"",""]
[{"$nulls":3},"","","","",null,null,"",""]
[{"$nulls":3},"","","","",null,null,"",""]
[{"$nulls":3},"","","","",null,null,"",""]
[{"$nulls":3},"","","","",null,null,"",""]
[{"$nulls":3},"","","","",null,null,"",""]
[{"$nulls":3},"","","","",null,null,"",""]
[{"$nulls":3},"","","","",null,null,"",""]
[{"$nulls":3},"","","","",null,null,"",""]
[{"$nulls":3},"","","","",null,null,"",""]
[{"$nulls":3},"","","","",null,null,"",""]
[{"$nulls":3},"","","","",null,null,"",""]
[{"$nulls":3},"","","","",null,null,"",""]
[{"$nulls":3},"","","","",null,null,"",""]
[{"$nulls":3},"","","","",null,null,"",""]
[{"$nulls":3},"","","","",null,null,"",""]
[{"$nulls":3},"","","","",null,null,"",""]
[{"$f":"IF(G34>100,\"Segment xBus surchargé! Déplacer des modules à un autre segment. Voir registre 'Informations'.\",\"Plus d'informations sont à disposition au registre 'Informations'.\")","v":"Plus d'informations sont à disposition au registre 'Informations'."},{"$nulls":3},{"$f":"SUM(E11:E33)","v":{"v":0,"d":"0 mA"}},{"$f":"SUM(F10:F33)","v":{"v":0.5,"d":"0.5 W"}},{"$f":"SUM(G11:G33)","v":{"v":0,"d":"0 %"}},null,null,{"$f":"SUM(J11:J33)","v":{"v":0,"d":"0 mA"}},{"$f":"SUM(K10:K33)","v":{"v":0.5,"d":"0.5 W"}}]

{"sheet":"Exemple","index":4,"n_rows":34,"n_cols":11,"rows_kept":34,"merged":[[2,1,2,6],[3,1,3,6],[4,1,4,6],[5,1,5,6],[6,1,6,5],[7,3,7,6],[7,9,7,10],[33,0,33,3]]}
["Aide à la planification des segments xBus",{"$nulls":9},{"$f":"Version","v":"V2.00"}]
[]
["Projet:","maison xy"]
["Segment:","rez"]
["Client:","commune de z"]
["Responsable:","abc électricité SA"]
["Notes:",{"$nulls":5},{"$f":"IF(ISBLANK($B$10),\"\",VLOOKUP($B$10,Liste_Gateways_Komplett,2,FALSE))","v":{"v":290,"d":"290.0"}},{"$f":"IF(ISBLANK($B$10),\"\",VLOOKUP($B$10,Liste_Gateways_Komplett,3,FALSE))","v":0.5},{"$f":"IF(ISBLANK($B$10),\"\",VLOOKUP($B$10,Liste_Gateways_Komplett,4,FALSE))","v":85}]
[{"$nulls":3},"Maximum",{"$nulls":5},"Moyenne"]
["Quantité","Modules","Notes","I [mA]","Courrant [mA]","Power [W]","Charge du bus [%]",null,null,"Courrant [mA]","Power [W]"]
[1,"xBG-B1-V","Passerelle xBus",null,null,{"$f":"H7+SUM(F11:F33)*I7/100","v":{"v":3.815,"d":"3.82"}},{"$nulls":4},{"$f":"H7+SUM(K11:K33)*I7/100","v":{"v":1.83875,"d":"1.84"}}]
[10,"xBS-K8TET-UP avec LED",null,{"$f":"IF(ISBLANK(B11),\"\",VLOOKUP(B11,Liste_Gesamt,2,FALSE))","v":{"v":15,"d":"15.0"}},{"$f":"IF(ISBLANK(B11),\"\",A11*D11)","v":150},{"$f":"IF(ISBLANK(B11),\"\",E11*xBus_U/1000+VLOOKUP(B11,Liste_Gesamt,5,FALSE))","v":2.25},{"$f":"IF(ISBLANK(B11),\"\",100*E11/$G$7)","v":{"v":51.724137931034484,"d":"51.7"}},null,null,{"$f":"IF(ISBLANK(B11),\"\",VLOOKUP(B11,Liste_Gesamt,4,FALSE) * A11)","v":{"v":70,"d":"70.0"}},{"$f":"IF(ISBLANK(B11),\"\",J11*xBus_U/1000+VLOOKUP(B11,Liste_Gesamt,5,FALSE))","v":1.05}]
[20,"xBS-K4TE-UP sans LED",null,{"v":3,"d":"3.0"},60,0.9,{"v":20.689655172413794,"d":"20.7"},null,null,{"v":10,"d":"10.0"},0.15]
[5,"xBS-PRP360L-UP",null,{"v":10,"d":"10.0"},50,0.75,{"v":17.24137931034483,"d":"17.2"},null,null,{"v":25,"d":"25.0"},0.375]
[{"$nulls":3},"","","","",null,null,"",""]
[{"$nulls":3},"","","","",null,null,"",""]
[{"$nulls":3},"","","","",null,null,"",""]
[{"$nulls":3},"","","","",null,null,"",""]
[{"$nulls":3},"","","","",null,null,"",""]
[{"$nulls":3},"","","","",null,null,"",""]
[{"$nulls":3},"","","","",null,null,"",""]
[{"$nulls":3},"","","","",null,null,"",""]
[{"$nulls":3},"","","","",null,null,"",""]
[{"$nulls":3},"","","","",null,null,"",""]
[{"$nulls":3},"","","","",null,null,"",""]
[{"$nulls":3},"","","","",null,null,"",""]
[{"$nulls":3},"","","","",null,null,"",""]
[{"$nulls":3},"","","","",null,null,"",""]
[{"$nulls":3},"","","","",null,null,"",""]
[{"$nulls":3},"","","","",null,null,"",""]
[{"$nulls":3},"","","","",null,null,"",""]
[{"$nulls":3},"","","","",null,null,"",""]
[{"$nulls":3},"","","","",null,null,"",""]
[{"$nulls":3},"","","","",null,null,"",""]
[{"$f":"IF(G34>100,\"Segment xBus surchargé! Déplacer des modules à un autre segment. Voir registre 'Informations'.\",\"Plus d'informations sont à disposition au registre 'Informations'.\")","v":"Plus d'informations sont à disposition au registre 'Informations'."},{"$nulls":3},{"$f":"SUM(E11:E33)","v":{"v":260,"d":"260 mA"}},{"$f":"SUM(F10:F33)","v":{"v":7.715,"d":"7.7 W"}},{"$f":"SUM(G11:G33)","v":{"v":89.65517241379311,"d":"90 %"}},null,null,{"$f":"SUM(J11:J33)","v":{"v":105,"d":"105 mA"}},{"$f":"SUM(K10:K33)","v":{"v":3.41375,"d":"3.4 W"}}]

{"sheet":"Informations","index":5,"n_rows":6,"n_cols":2,"rows_kept":6,"merged":[[3,0,3,1]]}
["Informations sur le xBus",{"$f":"Version","v":"V2.00"}]
[]
["Principes de base:"]
["L'alimentation électrique et la transmission des données s'effectuent via deux fils de bus. Les coupleurs de bus compacts servent de coupleurs pour les différents signaux d'entrée physiques. Ils sont disponibles pour un maximum de huit signaux d'entrée numériques ou deux signaux d'entrée analogiques. Il existe une gamme complète de dispositifs avec des coupleurs intégrés permettant d'intégrer toutes les informations nécessaires dans le bâtiment, tels que les boutons de lampes et de volets, les détecteurs de température ambiante, les détecteurs de mouvement, les récepteurs de télécommande, etc.\n\nLa ligne à 2 fils est exploitée de manière centralisée avec une basse tension (15VDC) à partir d'une alimentation électrique. Grâce à la très basse tension, l'installation est sûre et résistante au toucher et offre ainsi une protection personnelle active. Les appareils de terrain sont connectés au câble à 2 fils en fonction de la polarité. Tous les appareils de terrain sont protégés contre l'inversion de polarité.\n\nUne unité centrale peut fournir jusqu'à 10 segments xBus isolés électriquement les uns des autres par des passerelles xBus xBG-Bx-V. En outre, les segments xBus peuvent être découplés par des répéteurs. Le nombre maximum d'appareils de terrain par segment de xBus dépend du type et du nombre d'appareils de terrain. Pour l'attribution des adresses des appareils de terrain, le segment xBus auquel les appareils de terrain sont connectés n'a pas d'importance. "]
["Planification:","Exemple structur:"]
["Grâce à cette aide à la planification, les différents segments xBus peuvent être affectés de manière fiable à des appareils de terrain, de sorte que la charge maximale du bus par segment ne soit pas dépassée. Il est recommandé de prévoir une réserve d'environ 10 à 20 % pour les modernisations ultérieures.\n\nSi la charge calculée du bus dans un segment dépasse 100 %, les appareils de terrain doivent être remplacés par un nouveau segment. Cela peut se faire en connectant une autre passerelle xBus xBG-Bx-V à la Bluebox ou en utilisant un répéteur xBR-H1N-V (voir l'exemple de structure).\n\nL'installation doit être réalisée avec du U72 1x4x0,8mm. Lorsque vous utilisez une paire de conducteurs (2x0,8 mm), la longueur maximale de câble par segment xBus est de 200 m."]

{"sheet":"Liste des modules","index":6,"n_rows":52,"n_cols":14,"rows_kept":52,"merged":[[0,1,0,2],[0,3,0,4]]}
[null,"Maximal",null,"Durchschnitt"]
["Modules","I [mA]","Pext [W]","I [mA]","Pext [W]",null,"xBus-Gateways","Imax [mA]","Pidle [W]","n [%]",null,"Version:",null,"xBus-Spannung:"]
[{"$nulls":6},"xBG-B1-V",{"v":290,"d":"290.0"},0.5,{"v":85,"d":"85.0"},null,"V2.00",null,{"v":15,"d":"15.0"}]
["** BOUTONS POUSSOIRS EDIZIO **",{"$nulls":5},"xBG-B2-V",{"v":590,"d":"590.0"},0.5,{"v":85,"d":"85.0"}]
["xBS-K4TE-UP sans LED",{"v":3,"d":"3.0"},{"v":0,"d":"0.0"},0.5,{"v":0,"d":"0.0"}]
["xBS-K4TE-UP avec LED",{"v":7,"d":"7.0"},{"v":0,"d":"0.0"},{"v":3,"d":"3.0"},{"v":0,"d":"0.0"}]
["xBS-K8TE-UP sans LED",{"v":4,"d":"4.0"},{"v":0,"d":"0.0"},{"v":2,"d":"2.0"},{"v":0,"d":"0.0"}]
["xBS-K8TE-UP avec LED",{"v":15,"d":"15.0"},{"v":0,"d":"0.0"},{"v":7,"d":"7.0"},{"v":0,"d":"0.0"}]
["xBS-K8TET-UP sans LED",{"v":4,"d":"4.0"},{"v":0,"d":"0.0"},{"v":2,"d":"2.0"},{"v":0,"d":"0.0"}]
["xBS-K8TET-UP avec LED",{"v":15,"d":"15.0"},{"v":0,"d":"0.0"},{"v":7,"d":"7.0"},{"v":0,"d":"0.0"}]
[]
["** CAPTEURS DIGITAL **"]
["xBS-K4DU-D",{"v":7,"d":"7.0"},{"v":0,"d":"0.0"},{"v":1,"d":"1.0"},{"v":0,"d":"0.0"}]
["xBS-K2DN-D",{"v":7,"d":"7.0"},{"v":0,"d":"0.0"},{"v":3,"d":"3.0"},{"v":0,"d":"0.0"}]
["xBS-K4DIO-D",{"v":8,"d":"8.0"},{"v":0,"d":"0.0"},{"v":3,"d":"3.0"},{"v":0,"d":"0.0"}]
[]
["** CAPTEURS ANALOG **"]
["xBS-KMRT-D",{"v":10,"d":"10.0"},{"v":0,"d":"0.0"},{"v":2,"d":"2.0"},{"v":0,"d":"0.0"}]
["xBS-MRTD-UP",{"v":10,"d":"10.0"},{"v":0,"d":"0.0"},{"v":4,"d":"4.0"},{"v":0,"d":"0.0"}]
["xBS-MRHD-UP",{"v":10,"d":"10.0"},{"v":0,"d":"0.0"},{"v":4,"d":"4.0"},{"v":0,"d":"0.0"}]
["xBS-MLUX-UP",{"v":5,"d":"5.0"},{"v":0,"d":"0.0"},{"v":1,"d":"1.0"},{"v":0,"d":"0.0"}]
["xBS-K8UIF-V",{"v":2,"d":"2.0"},null,0.5]
[]
["** DETECTEURS DE MOUVEMENT **"]
["xBS-KPIR-UP",{"v":5,"d":"5.0"},{"v":0,"d":"0.0"},2.5,{"v":0,"d":"0.0"}]
["xBS-BMA-AP",{"v":10,"d":"10.0"},{"v":0,"d":"0.0"},{"v":6,"d":"6.0"},{"v":0,"d":"0.0"}]
["xBS-BMA2-AP",{"v":10,"d":"10.0"},{"v":0,"d":"0.0"},{"v":6,"d":"6.0"},{"v":0,"d":"0.0"}]
["xBS-PCO-UP",{"v":20,"d":"20.0"},{"v":0,"d":"0.0"},{"v":6,"d":"6.0"},{"v":0,"d":"0.0"},"Aufstarten"]
["xBS-PEC-UP",{"v":20,"d":"20.0"},{"v":0,"d":"0.0"},{"v":9,"d":"9.0"},{"v":0,"d":"0.0"},"Aufstarten"]
["xBS-PRS360-UP",{"v":20,"d":"20.0"},{"v":0,"d":"0.0"},{"v":6,"d":"6.0"},{"v":0,"d":"0.0"},"Aufstarten"]
["xBS-PRP360-UP",{"v":20,"d":"20.0"},{"v":0,"d":"0.0"},{"v":6,"d":"6.0"},{"v":0,"d":"0.0"},"Aufstarten"]
["xBS-PRP360L-UP",{"v":10,"d":"10.0"},{"v":0,"d":"0.0"},{"v":5,"d":"5.0"},{"v":0,"d":"0.0"}]
[]
["** ENOCEAN **"]
["xBG-EO1-D",{"v":19,"d":"19.0"},{"v":0,"d":"0.0"},{"v":16,"d":"16.0"},{"v":0,"d":"0.0"}]
["xBG-EO2-D",{"v":19,"d":"19.0"},{"v":0,"d":"0.0"},{"v":16,"d":"16.0"},{"v":0,"d":"0.0"}]
[]
["** ACTIONNEURS **"]
["xBA-S2-D",{"v":10,"d":"10.0"},{"v":0,"d":"0.0"},{"v":4,"d":"4.0"},{"v":0,"d":"0.0"}]
["xBA-R12-D",{"v":10,"d":"10.0"},{"v":0,"d":"0.0"},{"v":3,"d":"3.0"},{"v":0,"d":"0.0"}]
["xBA-S4-V",{"v":15,"d":"15.0"},{"v":0,"d":"0.0"},{"v":4,"d":"4.0"},{"v":0,"d":"0.0"}]
["xBA-R22-V",{"v":13,"d":"13.0"},{"v":0,"d":"0.0"},{"v":3,"d":"3.0"},{"v":0,"d":"0.0"}]
["xBA-R13-V",{"v":13,"d":"13.0"},{"v":0,"d":"0.0"},{"v":3,"d":"3.0"},{"v":0,"d":"0.0"}]
["xBA-R22DC-V",{"v":13,"d":"13.0"},{"v":0,"d":"0.0"},{"v":3,"d":"3.0"},{"v":0,"d":"0.0"}]
["xBA-R62-V",{"v":2,"d":"2.0"},null,0.5]
["xBA-R43-V",{"v":2,"d":"2.0"},null,0.5]
["xBA-D4-V",{"v":15,"d":"15.0"},null,{"v":10,"d":"10.0"}]
["xBA-D2EVG-V",{"v":13,"d":"13.0"},{"v":0,"d":"0.0"},{"v":10,"d":"10.0"},{"v":0,"d":"0.0"}]
["xBG-DA-V",{"v":2,"d":"2.0"},null,0.5]
[]
["** REPEATER **"]
["xBR-H1N-G",{"v":10,"d":"10.0"},null,{"v":10,"d":"10.0"}]