{"text_format":"3","workbook":"xlsx","n_sheets":7,"sheets":["Segment 1","Segment 2","Segment 3","Segment 4","Beispiel","Informationen","Geräteliste"],"not_rendered":{"images":2,"defined_names":13,"comments":6},"read":"whole","date_system":"1900"}

{"sheet":"Segment 1","index":0,"n_rows":34,"n_cols":11,"rows_kept":34,"merged":[[2,1,2,6],[3,1,3,6],[4,1,4,6],[5,1,5,6],[6,1,6,5],[7,3,7,6],[7,9,7,10],[33,0,33,3]]}
["Planungshilfe für xBus-Segmente",{"$nulls":9},{"$f":"Version","v":"V2.00"}]
[]
["Projekt:"]
["Segment:"]
["Kunde:"]
["Planung:"]
["Notizen:",{"$nulls":5},{"$f":"IF(ISBLANK($B$10),\"\",VLOOKUP($B$10,Liste_Gateways_Komplett,2,FALSE))","v":{"v":290,"d":"290.0"}},{"$f":"IF(ISBLANK($B$10),\"\",VLOOKUP($B$10,Liste_Gateways_Komplett,3,FALSE))","v":0.5},{"$f":"IF(ISBLANK($B$10),\"\",VLOOKUP($B$10,Liste_Gateways_Komplett,4,FALSE))","v":85}]
[{"$nulls":3},"Maximal",{"$nulls":5},"Durchschnitt"]
["Anzahl","Gerät","Notizen","I [mA]","Strom [mA]","Leistung [W]","Buslast [%]",null,null,"Strom [mA]","Leistung [W]"]
[1,"xBG-B1-V","xBus-Gateway",null,null,{"$f":"H7+SUM(F11:F33)*I7/100","v":{"v":0.5,"d":"0.50"}},{"$nulls":4},{"$f":"H7+SUM(K11:K33)*I7/100","v":{"v":0.5,"d":"0.50"}}]
[{"$nulls":3},{"$f":"IF(ISBLANK(B11),\"\",VLOOKUP(B11,Liste_Gesamt,2,FALSE))","v":""},{"$f":"IF(ISBLANK(B11),\"\",A11*D11)","v":""},{"$f":"IF(ISBLANK(B11),\"\",E11*xBus_U/1000+VLOOKUP(B11,Liste_Gesamt,5,FALSE))","v":""},{"$f":"IF(ISBLANK(B11),\"\",100*E11/$G$7)","v":""},null,null,{"$f":"IF(ISBLANK(B11),\"\",VLOOKUP(B11,Liste_Gesamt,4,FALSE) * A11)","v":""},{"$f":"IF(ISBLANK(B11),\"\",J11*xBus_U/1000+VLOOKUP(B11,Liste_Gesamt,5,FALSE))","v":""}]
[{"$nulls":3},"","","","",null,null,"",""]
[{"$nulls":3},"","","","",null,null,"",""]
[{"$nulls":3},"","","","",null,null,"",""]
[{"$nulls":3},"","","","",null,null,"",""]
[{"$nulls":3},"","","","",null,null,"",""]
[{"$nulls":3},"","","","",null,null,"",""]
[{"$nulls":3},"","","","",null,null,"",""]
[{"$nulls":3},"","","","",null,null,"",""]
[{"$nulls":3},"","","","",null,null,"",""]
[{"$nulls":3},"","","","",null,null,"",""]
[{"$nulls":3},"","","","",null,null,"",""]
[{"$nulls":3},"","","","",null,null,"",""]
[{"$nulls":3},"","","","",null,null,"",""]
[{"$nulls":3},"","","","",null,null,"",""]
[{"$nulls":3},"","","","",null,null,"",""]
[{"$nulls":3},"","","","",null,null,"",""]
[{"$nulls":3},"","","","",null,null,"",""]
[{"$nulls":3},"","","","",null,null,"",""]
[{"$nulls":3},"","","","",null,null,"",""]
[{"$nulls":3},"","","","",null,null,"",""]
[{"$nulls":3},"","","","",null,null,"",""]
[{"$nulls":3},"","","","",null,null,"",""]
[{"$f":"IF(G34>100,\"xBus-Segment ist überlastet! Einige Geräte in ein neues Segment wechseln. Siehe Register 'Informationen'.\",\"Weitere Informationen zur Planung finden Sie in Register 'Informationen'.\")","v":"Weitere Informationen zur Planung finden Sie in Register 'Informationen'."},{"$nulls":3},{"$f":"SUM(E11:E33)","v":{"v":0,"d":"0 mA"}},{"$f":"SUM(F10:F33)","v":{"v":0.5,"d":"0.5 W"}},{"$f":"SUM(G11:G33)","v":{"v":0,"d":"0 %"}},null,null,{"$f":"SUM(J11:J33)","v":{"v":0,"d":"0 mA"}},{"$f":"SUM(K10:K33)","v":{"v":0.5,"d":"0.5 W"}}]

{"sheet":"Segment 2","index":1,"n_rows":34,"n_cols":11,"rows_kept":34,"merged":[[2,1,2,6],[3,1,3,6],[4,1,4,6],[5,1,5,6],[6,1,6,5],[7,3,7,6],[7,9,7,10],[33,0,33,3]]}
["Planungshilfe für xBus-Segmente",{"$nulls":9},{"$f":"Version","v":"V2.00"}]
[]
["Projekt:"]
["Segment:"]
["Kunde:"]
["Planung:"]
["Notizen:",{"$nulls":5},{"$f":"IF(ISBLANK($B$10),\"\",VLOOKUP($B$10,Liste_Gateways_Komplett,2,FALSE))","v":{"v":290,"d":"290.0"}},{"$f":"IF(ISBLANK($B$10),\"\",VLOOKUP($B$10,Liste_Gateways_Komplett,3,FALSE))","v":0.5},{"$f":"IF(ISBLANK($B$10),\"\",VLOOKUP($B$10,Liste_Gateways_Komplett,4,FALSE))","v":85}]
[{"$nulls":3},"Maximal",{"$nulls":5},"Durchschnitt"]
["Anzahl","Gerät","Notizen","I [mA]","Strom [mA]","Leistung [W]","Buslast [%]",null,null,"Strom [mA]","Leistung [W]"]
[1,"xBG-B1-V","xBus-Gateway",null,null,{"$f":"H7+SUM(F11:F33)*I7/100","v":{"v":0.5,"d":"0.50"}},{"$nulls":4},{"$f":"H7+SUM(K11:K33)*I7/100","v":{"v":0.5,"d":"0.50"}}]
[{"$nulls":3},{"$f":"IF(ISBLANK(B11),\"\",VLOOKUP(B11,Liste_Gesamt,2,FALSE))","v":""},{"$f":"IF(ISBLANK(B11),\"\",A11*D11)","v":""},{"$f":"IF(ISBLANK(B11),\"\",E11*xBus_U/1000+VLOOKUP(B11,Liste_Gesamt,5,FALSE))","v":""},{"$f":"IF(ISBLANK(B11),\"\",100*E11/$G$7)","v":""},null,null,{"$f":"IF(ISBLANK(B11),\"\",VLOOKUP(B11,Liste_Gesamt,4,FALSE) * A11)","v":""},{"$f":"IF(ISBLANK(B11),\"\",J11*xBus_U/1000+VLOOKUP(B11,Liste_Gesamt,5,FALSE))","v":""}]
[{"$nulls":3},"","","","",null,null,"",""]
[{"$nulls":3},"","","","",null,null,"",""]
[{"$nulls":3},"","","","",null,null,"",""]
[{"$nulls":3},"","","","",null,null,"",""]
[{"$nulls":3},"","","","",null,null,"",""]
[{"$nulls":3},"","","","",null,null,"",""]
[{"$nulls":3},"","","","",null,null,"",""]
[{"$nulls":3},"","","","",null,null,"",""]
[{"$nulls":3},"","","","",null,null,"",""]
[{"$nulls":3},"","","","",null,null,"",""]
[{"$nulls":3},"","","","",null,null,"",""]
[{"$nulls":3},"","","","",null,null,"",""]
[{"$nulls":3},"","","","",null,null,"",""]
[{"$nulls":3},"","","","",null,null,"",""]
[{"$nulls":3},"","","","",null,null,"",""]
[{"$nulls":3},"","","","",null,null,"",""]
[{"$nulls":3},"","","","",null,null,"",""]
[{"$nulls":3},"","","","",null,null,"",""]
[{"$nulls":3},"","","","",null,null,"",""]
[{"$nulls":3},"","","","",null,null,"",""]
[{"$nulls":3},"","","","",null,null,"",""]
[{"$nulls":3},"","","","",null,null,"",""]
[{"$f":"IF(G34>100,\"xBus-Segment ist überlastet! Einige Geräte in ein neues Segment wechseln. Siehe Register 'Informationen'.\",\"Weitere Informationen zur Planung finden Sie in Register 'Informationen'.\")","v":"Weitere Informationen zur Planung finden Sie in Register 'Informationen'."},{"$nulls":3},{"$f":"SUM(E11:E33)","v":{"v":0,"d":"0 mA"}},{"$f":"SUM(F10:F33)","v":{"v":0.5,"d":"0.5 W"}},{"$f":"SUM(G11:G33)","v":{"v":0,"d":"0 %"}},null,null,{"$f":"SUM(J11:J33)","v":{"v":0,"d":"0 mA"}},{"$f":"SUM(K10:K33)","v":{"v":0.5,"d":"0.5 W"}}]

{"sheet":"Segment 3","index":2,"n_rows":34,"n_cols":11,"rows_kept":34,"merged":[[2,1,2,6],[3,1,3,6],[4,1,4,6],[5,1,5,6],[6,1,6,5],[7,3,7,6],[7,9,7,10],[33,0,33,3]]}
["Planungshilfe für xBus-Segmente",{"$nulls":9},{"$f":"Version","v":"V2.00"}]
[]
["Projekt:"]
["Segment:"]
["Kunde:"]
["Planung:"]
["Notizen:",{"$nulls":5},{"$f":"IF(ISBLANK($B$10),\"\",VLOOKUP($B$10,Liste_Gateways_Komplett,2,FALSE))","v":{"v":290,"d":"290.0"}},{"$f":"IF(ISBLANK($B$10),\"\",VLOOKUP($B$10,Liste_Gateways_Komplett,3,FALSE))","v":0.5},{"$f":"IF(ISBLANK($B$10),\"\",VLOOKUP($B$10,Liste_Gateways_Komplett,4,FALSE))","v":85}]
[{"$nulls":3},"Maximal",{"$nulls":5},"Durchschnitt"]
["Anzahl","Gerät","Notizen","I [mA]","Strom [mA]","Leistung [W]","Buslast [%]",null,null,"Strom [mA]","Leistung [W]"]
[1,"xBG-B1-V","xBus-Gateway",null,null,{"$f":"H7+SUM(F11:F33)*I7/100","v":{"v":0.5,"d":"0.50"}},{"$nulls":4},{"$f":"H7+SUM(K11:K33)*I7/100","v":{"v":0.5,"d":"0.50"}}]
[{"$nulls":3},{"$f":"IF(ISBLANK(B11),\"\",VLOOKUP(B11,Liste_Gesamt,2,FALSE))","v":""},{"$f":"IF(ISBLANK(B11),\"\",A11*D11)","v":""},{"$f":"IF(ISBLANK(B11),\"\",E11*xBus_U/1000+VLOOKUP(B11,Liste_Gesamt,5,FALSE))","v":""},{"$f":"IF(ISBLANK(B11),\"\",100*E11/$G$7)","v":""},null,null,{"$f":"IF(ISBLANK(B11),\"\",VLOOKUP(B11,Liste_Gesamt,4,FALSE) * A11)","v":""},{"$f":"IF(ISBLANK(B11),\"\",J11*xBus_U/1000+VLOOKUP(B11,Liste_Gesamt,5,FALSE))","v":""}]
[{"$nulls":3},"","","","",null,null,"",""]
[{"$nulls":3},"","","","",null,null,"",""]
[{"$nulls":3},"","","","",null,null,"",""]
[{"$nulls":3},"","","","",null,null,"",""]
[{"$nulls":3},"","","","",null,null,"",""]
[{"$nulls":3},"","","","",null,null,"",""]
[{"$nulls":3},"","","","",null,null,"",""]
[{"$nulls":3},"","","","",null,null,"",""]
[{"$nulls":3},"","","","",null,null,"",""]
[{"$nulls":3},"","","","",null,null,"",""]
[{"$nulls":3},"","","","",null,null,"",""]
[{"$nulls":3},"","","","",null,null,"",""]
[{"$nulls":3},"","","","",null,null,"",""]
[{"$nulls":3},"","","","",null,null,"",""]
[{"$nulls":3},"","","","",null,null,"",""]
[{"$nulls":3},"","","","",null,null,"",""]
[{"$nulls":3},"","","","",null,null,"",""]
[{"$nulls":3},"","","","",null,null,"",""]
[{"$nulls":3},"","","","",null,null,"",""]
[{"$nulls":3},"","","","",null,null,"",""]
[{"$nulls":3},"","","","",null,null,"",""]
[{"$nulls":3},"","","","",null,null,"",""]
[{"$f":"IF(G34>100,\"xBus-Segment ist überlastet! Einige Geräte in ein neues Segment wechseln. Siehe Register 'Informationen'.\",\"Weitere Informationen zur Planung finden Sie in Register 'Informationen'.\")","v":"Weitere Informationen zur Planung finden Sie in Register 'Informationen'."},{"$nulls":3},{"$f":"SUM(E11:E33)","v":{"v":0,"d":"0 mA"}},{"$f":"SUM(F10:F33)","v":{"v":0.5,"d":"0.5 W"}},{"$f":"SUM(G11:G33)","v":{"v":0,"d":"0 %"}},null,null,{"$f":"SUM(J11:J33)","v":{"v":0,"d":"0 mA"}},{"$f":"SUM(K10:K33)","v":{"v":0.5,"d":"0.5 W"}}]

{"sheet":"Segment 4","index":3,"n_rows":34,"n_cols":11,"rows_kept":34,"merged":[[2,1,2,6],[3,1,3,6],[4,1,4,6],[5,1,5,6],[6,1,6,5],[7,3,7,6],[7,9,7,10],[33,0,33,3]]}
["Planungshilfe für xBus-Segmente",{"$nulls":9},{"$f":"Version","v":"V2.00"}]
[]
["Projekt:"]
["Segment:"]
["Kunde:"]
["Planung:"]
["Notizen:",{"$nulls":5},{"$f":"IF(ISBLANK($B$10),\"\",VLOOKUP($B$10,Liste_Gateways_Komplett,2,FALSE))","v":{"v":290,"d":"290.0"}},{"$f":"IF(ISBLANK($B$10),\"\",VLOOKUP($B$10,Liste_Gateways_Komplett,3,FALSE))","v":0.5},{"$f":"IF(ISBLANK($B$10),\"\",VLOOKUP($B$10,Liste_Gateways_Komplett,4,FALSE))","v":85}]
[{"$nulls":3},"Maximal",{"$nulls":5},"Durchschnitt"]
["Anzahl","Gerät","Notizen","I [mA]","Strom [mA]","Leistung [W]","Buslast [%]",null,null,"Strom [mA]","Leistung [W]"]
[1,"xBG-B1-V","xBus-Gateway",null,null,{"$f":"H7+SUM(F11:F33)*I7/100","v":{"v":0.5,"d":"0.50"}},{"$nulls":4},{"$f":"H7+SUM(K11:K33)*I7/100","v":{"v":0.5,"d":"0.50"}}]
[{"$nulls":3},{"$f":"IF(ISBLANK(B11),\"\",VLOOKUP(B11,Liste_Gesamt,2,FALSE))","v":""},{"$f":"IF(ISBLANK(B11),\"\",A11*D11)","v":""},{"$f":"IF(ISBLANK(B11),\"\",E11*xBus_U/1000+VLOOKUP(B11,Liste_Gesamt,5,FALSE))","v":""},{"$f":"IF(ISBLANK(B11),\"\",100*E11/$G$7)","v":""},null,null,{"$f":"IF(ISBLANK(B11),\"\",VLOOKUP(B11,Liste_Gesamt,4,FALSE) * A11)","v":""},{"$f":"IF(ISBLANK(B11),\"\",J11*xBus_U/1000+VLOOKUP(B11,Liste_Gesamt,5,FALSE))","v":""}]
[{"$nulls":3},"","","","",null,null,"",""]
[{"$nulls":3},"","","","",null,null,"",""]
[{"$nulls":3},"","","","",null,null,"",""]
[{"$nulls":3},"","","","",null,null,"",""]
[{"$nulls":3},"","","","",null,null,"",""]
[{"$nulls":3},"","","","",null,null,"",""]
[{"$nulls":3},"","","","",null,null,"",""]
[{"$nulls":3},"","","","",null,null,"",""]
[{"$nulls":3},"","","","",null,null,"",""]
[{"$nulls":3},"","","","",null,null,"",""]
[{"$nulls":3},"","","","",null,null,"",""]
[{"$nulls":3},"","","","",null,null,"",""]
[{"$nulls":3},"","","","",null,null,"",""]
[{"$nulls":3},"","","","",null,null,"",""]
[{"$nulls":3},"","","","",null,null,"",""]
[{"$nulls":3},"","","","",null,null,"",""]
[{"$nulls":3},"","","","",null,null,"",""]
[{"$nulls":3},"","","","",null,null,"",""]
[{"$nulls":3},"","","","",null,null,"",""]
[{"$nulls":3},"","","","",null,null,"",""]
[{"$nulls":3},"","","","",null,null,"",""]
[{"$nulls":3},"","","","",null,null,"",""]
[{"$f":"IF(G34>100,\"xBus-Segment ist überlastet! Einige Geräte in ein neues Segment wechseln. Siehe Register 'Informationen'.\",\"Weitere Informationen zur Planung finden Sie in Register 'Informationen'.\")","v":"Weitere Informationen zur Planung finden Sie in Register 'Informationen'."},{"$nulls":3},{"$f":"SUM(E11:E33)","v":{"v":0,"d":"0 mA"}},{"$f":"SUM(F10:F33)","v":{"v":0.5,"d":"0.5 W"}},{"$f":"SUM(G11:G33)","v":{"v":0,"d":"0 %"}},null,null,{"$f":"SUM(J11:J33)","v":{"v":0,"d":"0 mA"}},{"$f":"SUM(K10:K33)","v":{"v":0.5,"d":"0.5 W"}}]

{"sheet":"Beispiel","index":4,"n_rows":34,"n_cols":11,"rows_kept":34,"merged":[[2,1,2,6],[3,1,3,6],[4,1,4,6],[5,1,5,6],[6,1,6,5],[7,3,7,6],[7,9,7,10],[33,0,33,3]]}
["Planungshilfe für xBus-Segmente",{"$nulls":9},{"$f":"Version","v":"V2.00"}]
[]
["Projekt:","Schulhaus Hinterfultigen"]
["Segment:","1. OG"]
["Kunde:","Gemeinde Hinterfultigen"]
["Planung:","Elektro Fult AG"]
["Notizen:",{"$nulls":5},{"$f":"IF(ISBLANK($B$10),\"\",VLOOKUP($B$10,Liste_Gateways_Komplett,2,FALSE))","v":{"v":290,"d":"290.0"}},{"$f":"IF(ISBLANK($B$10),\"\",VLOOKUP($B$10,Liste_Gateways_Komplett,3,FALSE))","v":0.5},{"$f":"IF(ISBLANK($B$10),\"\",VLOOKUP($B$10,Liste_Gateways_Komplett,4,FALSE))","v":85}]
[{"$nulls":3},"Maximal",{"$nulls":5},"Durchschnitt"]
["Anzahl","Gerät","Notizen","I [mA]","Strom [mA]","Leistung [W]","Buslast [%]",null,null,"Strom [mA]","Leistung [W]"]
[1,"xBG-B1-V","xBus-Gateway",null,null,{"$f":"H7+SUM(F11:F33)*I7/100","v":{"v":3.815,"d":"3.82"}},{"$nulls":4},{"$f":"H7+SUM(K11:K33)*I7/100","v":{"v":1.83875,"d":"1.84"}}]
[10,"xBS-K8TET-UP mit LED",null,{"$f":"IF(ISBLANK(B11),\"\",VLOOKUP(B11,Liste_Gesamt,2,FALSE))","v":{"v":15,"d":"15.0"}},{"$f":"IF(ISBLANK(B11),\"\",A11*D11)","v":150},{"$f":"IF(ISBLANK(B11),\"\",E11*xBus_U/1000+VLOOKUP(B11,Liste_Gesamt,5,FALSE))","v":2.25},{"$f":"IF(ISBLANK(B11),\"\",100*E11/$G$7)","v":{"v":51.724137931034484,"d":"51.7"}},null,null,{"$f":"IF(ISBLANK(B11),\"\",VLOOKUP(B11,Liste_Gesamt,4,FALSE) * A11)","v":{"v":70,"d":"70.0"}},{"$f":"IF(ISBLANK(B11),\"\",J11*xBus_U/1000+VLOOKUP(B11,Liste_Gesamt,5,FALSE))","v":1.05}]
[20,"xBS-K4TE-UP ohne LED",null,{"v":3,"d":"3.0"},60,0.9,{"v":20.689655172413794,"d":"20.7"},null,null,{"v":10,"d":"10.0"},0.15]
[5,"xBS-PRP360L-UP",null,{"v":10,"d":"10.0"},50,0.75,{"v":17.24137931034483,"d":"17.2"},null,null,{"v":25,"d":"25.0"},0.375]
[{"$nulls":3},"","","","",null,null,"",""]
[{"$nulls":3},"","","","",null,null,"",""]
[{"$nulls":3},"","","","",null,null,"",""]
[{"$nulls":3},"","","","",null,null,"",""]
[{"$nulls":3},"","","","",null,null,"",""]
[{"$nulls":3},"","","","",null,null,"",""]
[{"$nulls":3},"","","","",null,null,"",""]
[{"$nulls":3},"","","","",null,null,"",""]
[{"$nulls":3},"","","","",null,null,"",""]
[{"$nulls":3},"","","","",null,null,"",""]
[{"$nulls":3},"","","","",null,null,"",""]
[{"$nulls":3},"","","","",null,null,"",""]
[{"$nulls":3},"","","","",null,null,"",""]
[{"$nulls":3},"","","","",null,null,"",""]
[{"$nulls":3},"","","","",null,null,"",""]
[{"$nulls":3},"","","","",null,null,"",""]
[{"$nulls":3},"","","","",null,null,"",""]
[{"$nulls":3},"","","","",null,null,"",""]
[{"$nulls":3},"","","","",null,null,"",""]
[{"$nulls":3},"","","","",null,null,"",""]
[{"$f":"IF(G34>100,\"xBus-Segment ist überlastet! Einige Geräte in ein neues Segment wechseln. Siehe Register 'Informationen'.\",\"Weitere Informationen zur Planung finden Sie in Register 'Informationen'.\")","v":"Weitere Informationen zur Planung finden Sie in Register 'Informationen'."},{"$nulls":3},{"$f":"SUM(E11:E33)","v":{"v":260,"d":"260 mA"}},{"$f":"SUM(F10:F33)","v":{"v":7.715,"d":"7.7 W"}},{"$f":"SUM(G11:G33)","v":{"v":89.65517241379311,"d":"90 %"}},null,null,{"$f":"SUM(J11:J33)","v":{"v":105,"d":"105 mA"}},{"$f":"SUM(K10:K33)","v":{"v":3.41375,"d":"3.4 W"}}]

{"sheet":"Informationen","index":5,"n_rows":6,"n_cols":2,"rows_kept":6,"merged":[[3,0,3,1]]}
["Informationen zu xBus",{"$f":"Version","v":"V2.00"}]
[]
["Grundlagen:"]
["Die Spannungsversorgung und die Datenübertragung erfolgen über zwei Busdrähte. Als Koppler für die verschiedenen physikalischen Eingangssignale dienen die kompakten Buskoppler. Diese sind erhältlich für bis acht digitale oder zwei analoge Eingangssignale. Es existiert eine komplette Palette von Geräten mit integrierten Kopplern zum Einbinden aller im Gebäude benötigten Informationen wie Lampen-, Rollladentaster, Raumtemperaturmelder, Bewegungsmelder, Fernbedienungsempfänger, etc.\n\nDie 2-Drahtleitung wird mit Kleinspannung (15VDC) von einer Spannungsversorgung zentral betrieben. Dank der Kleinspannung ist die Installation gefahrlos und berührungssicher und bietet somit einen aktiven Personenschutz. Die Feldgeräte werden polaritätsabhängig an die 2-Drahtleitung angeschlossen. Alle Feldgeräte sind gegen Verpolung geschützt.\n\nEine Zentrale kann über xBus-Gateways xBG-Bx-V bis zu 10 voneinander elektrisch isolierte xBus-Segmente bereitstellen. Desweiteren können über Repeater xBus-Segment entkoppelt werden. Die maximale Anzahl Feldgeräte pro xBus-Segment ist abhängig von der Art und Anzahl der Feldgeräte. Für die Adressvergabe der Feldgeräte spielt es keine Rolle, an welchem xBus-Segment die Feldgeräte angeschlossen sind. "]
["Planung:","Beispiel Struktur:"]
["Mit dieser Planungshilfe können die einzelnen xBus-Segmente zuverlässig mit Feldgeräten belegt werden, so dass die maximale Buslast pro Segment nicht überschritten wird. Es empfiehlt sich für spätere Nachrüstungen eine Reserve von ca. 10-20% einzuplanen.\n\nLiegt die berechnete Buslast in einem Segment über 100%, so sind Feldgeräte in ein neues Segment zu wechseln. Dies kann durch Anschluss eines weiteren xBus-Gateways xBG-Bx-V an die Bluebox oder durch Verwendung eines Repeaters xBR-H1N-V erfolgen (siehe Beispiel Struktur).\n\nDie Installation ist mit U72 1x4x0.8mm auszuführen. Bei Verwendung von einem Leiterpaar (2x0.8mm) liegt die maximale Leitungslänge pro xBus-Segment bei 200m."]

{"sheet":"Geräteliste","index":6,"n_rows":52,"n_cols":14,"rows_kept":52,"merged":[[0,1,0,2],[0,3,0,4]]}
[null,"Maximal",null,"Durchschnitt"]
["xBus-Geräte","I [mA]","Pext [W]","I [mA]","Pext [W]",null,"xBus-Gateways","Imax [mA]","Pidle [W]","n [%]",null,"Version:",null,"xBus-Spannung:"]
[{"$nulls":6},"xBG-B1-V",{"v":290,"d":"290.0"},0.5,{"v":85,"d":"85.0"},null,"V2.00",null,{"v":15,"d":"15.0"}]
["** TASTEN EDIZIO **",{"$nulls":5},"xBG-B2-V",{"v":590,"d":"590.0"},0.5,{"v":85,"d":"85.0"}]
["xBS-K4TE-UP ohne LED",{"v":3,"d":"3.0"},{"v":0,"d":"0.0"},0.5,{"v":0,"d":"0.0"}]
["xBS-K4TE-UP mit LED",{"v":7,"d":"7.0"},{"v":0,"d":"0.0"},{"v":3,"d":"3.0"},{"v":0,"d":"0.0"}]
["xBS-K8TE-UP ohne LED",{"v":4,"d":"4.0"},{"v":0,"d":"0.0"},{"v":2,"d":"2.0"},{"v":0,"d":"0.0"}]
["xBS-K8TE-UP mit LED",{"v":15,"d":"15.0"},{"v":0,"d":"0.0"},{"v":7,"d":"7.0"},{"v":0,"d":"0.0"}]
["xBS-K8TET-UP ohne LED",{"v":4,"d":"4.0"},{"v":0,"d":"0.0"},{"v":2,"d":"2.0"},{"v":0,"d":"0.0"}]
["xBS-K8TET-UP mit LED",{"v":15,"d":"15.0"},{"v":0,"d":"0.0"},{"v":7,"d":"7.0"},{"v":0,"d":"0.0"}]
[]
["** SENSOREN DIGITAL **"]
["xBS-K4DU-D",{"v":7,"d":"7.0"},{"v":0,"d":"0.0"},{"v":1,"d":"1.0"},{"v":0,"d":"0.0"}]
["xBS-K2DN-D",{"v":7,"d":"7.0"},{"v":0,"d":"0.0"},{"v":3,"d":"3.0"},{"v":0,"d":"0.0"}]
["xBS-K4DIO-D",{"v":8,"d":"8.0"},{"v":0,"d":"0.0"},{"v":3,"d":"3.0"},{"v":0,"d":"0.0"}]
[]
["** SENSOREN ANALOG **"]
["xBS-KMRT-D",{"v":10,"d":"10.0"},{"v":0,"d":"0.0"},{"v":2,"d":"2.0"},{"v":0,"d":"0.0"}]
["xBS-MRTD-UP",{"v":10,"d":"10.0"},{"v":0,"d":"0.0"},{"v":4,"d":"4.0"},{"v":0,"d":"0.0"}]
["xBS-MRHD-UP",{"v":10,"d":"10.0"},{"v":0,"d":"0.0"},{"v":4,"d":"4.0"},{"v":0,"d":"0.0"}]
["xBS-MLUX-UP",{"v":5,"d":"5.0"},{"v":0,"d":"0.0"},{"v":1,"d":"1.0"},{"v":0,"d":"0.0"}]
["xBS-K8UIF-V",{"v":2,"d":"2.0"},null,0.5]
[]
["** BEWEGUNGSMELDER **"]
["xBS-KPIR-UP",{"v":5,"d":"5.0"},{"v":0,"d":"0.0"},2.5,{"v":0,"d":"0.0"}]
["xBS-BMA-AP",{"v":10,"d":"10.0"},{"v":0,"d":"0.0"},{"v":6,"d":"6.0"},{"v":0,"d":"0.0"}]
["xBS-BMA2-AP",{"v":10,"d":"10.0"},{"v":0,"d":"0.0"},{"v":6,"d":"6.0"},{"v":0,"d":"0.0"}]
["xBS-PCO-UP",{"v":20,"d":"20.0"},{"v":0,"d":"0.0"},{"v":6,"d":"6.0"},{"v":0,"d":"0.0"},"Aufstarten"]
["xBS-PEC-UP",{"v":20,"d":"20.0"},{"v":0,"d":"0.0"},{"v":9,"d":"9.0"},{"v":0,"d":"0.0"},"Aufstarten"]
["xBS-PRS360-UP",{"v":20,"d":"20.0"},{"v":0,"d":"0.0"},{"v":6,"d":"6.0"},{"v":0,"d":"0.0"},"Aufstarten"]
["xBS-PRP360-UP",{"v":20,"d":"20.0"},{"v":0,"d":"0.0"},{"v":6,"d":"6.0"},{"v":0,"d":"0.0"},"Aufstarten"]
["xBS-PRP360L-UP",{"v":10,"d":"10.0"},{"v":0,"d":"0.0"},{"v":5,"d":"5.0"},{"v":0,"d":"0.0"}]
[]
["** ENOCEAN **"]
["xBG-EO1-D",{"v":19,"d":"19.0"},{"v":0,"d":"0.0"},{"v":16,"d":"16.0"},{"v":0,"d":"0.0"}]
["xBG-EO2-D",{"v":19,"d":"19.0"},{"v":0,"d":"0.0"},{"v":16,"d":"16.0"},{"v":0,"d":"0.0"}]
[]
["** AKTOREN **"]
["xBA-S2-D",{"v":10,"d":"10.0"},{"v":0,"d":"0.0"},{"v":4,"d":"4.0"},{"v":0,"d":"0.0"}]
["xBA-R12-D",{"v":10,"d":"10.0"},{"v":0,"d":"0.0"},{"v":3,"d":"3.0"},{"v":0,"d":"0.0"}]
["xBA-S4-V",{"v":15,"d":"15.0"},{"v":0,"d":"0.0"},{"v":4,"d":"4.0"},{"v":0,"d":"0.0"}]
["xBA-R22-V",{"v":13,"d":"13.0"},{"v":0,"d":"0.0"},{"v":3,"d":"3.0"},{"v":0,"d":"0.0"}]
["xBA-R13-V",{"v":13,"d":"13.0"},{"v":0,"d":"0.0"},{"v":3,"d":"3.0"},{"v":0,"d":"0.0"}]
["xBA-R22DC-V",{"v":13,"d":"13.0"},{"v":0,"d":"0.0"},{"v":3,"d":"3.0"},{"v":0,"d":"0.0"}]
["xBA-R62-V",{"v":2,"d":"2.0"},null,0.5]
["xBA-R43-V",{"v":2,"d":"2.0"},null,0.5]
["xBA-D4-V",{"v":15,"d":"15.0"},null,{"v":10,"d":"10.0"}]
["xBA-D2EVG-V",{"v":13,"d":"13.0"},{"v":0,"d":"0.0"},{"v":10,"d":"10.0"},{"v":0,"d":"0.0"}]
["xBG-DA-V",{"v":2,"d":"2.0"},null,0.5]
[]
["** REPEATER **"]
["xBR-H1N-G",{"v":10,"d":"10.0"},null,{"v":10,"d":"10.0"}]